{"text_format":"1","workbook":"xlsx","n_sheets":4,"sheets":["Budget","Cost Share","Source-Protected","Personnel-Protected"],"not_rendered":{"charts":0,"images":0,"macros":1,"external_links":0,"defined_names":58,"comments":2,"pivot_tables":0},"unopened":[],"bounds":{"document_bytes":16777216,"sheet_cells":100000,"rows_first":2000,"rows_last":500,"rows_between":2000,"halvings":0,"cell_chars":16384,"cell_head_chars":4096},"cells_cut":0,"cells_raw":0,"read":"whole","date_system":"1900"}

{"sheet":"Budget","index":0,"n_rows":149,"n_cols":17,"rows_kept":149,"cut":false,"hidden":false,"merged":[[0,16,1,16],[119,0,119,6],[117,0,117,6],[118,0,118,6],[121,0,121,7],[127,4,127,7],[128,4,128,7],[120,0,120,6],[126,0,126,3],[127,0,127,3],[128,0,128,3],[122,4,122,7],[123,4,123,7],[124,4,124,7],[125,4,125,7],[126,4,126,7],[122,0,122,3],[123,0,123,3],[124,0,124,3],[125,0,125,3],[116,0,116,6],[111,0,111,6],[112,0,112,6],[113,0,113,6],[145,0,145,7],[147,0,147,4],[148,0,148,4],[132,5,132,7],[133,5,133,7],[134,5,134,7],[135,5,135,7],[136,5,136,7],[130,0,130,3],[130,4,130,7],[132,0,132,4],[133,0,133,4],[134,0,134,4],[135,0,135,4],[136,0,136,4],[138,0,138,8],[141,0,141,7],[140,0,140,7],[142,0,142,8],[97,0,97,6],[107,0,107,6],[108,0,108,6],[110,0,110,6],[87,0,87,6],[88,0,88,6],[91,0,91,6],[115,0,115,6],[109,0,109,6],[98,0,98,6],[99,0,99,6],[100,0,100,6],[101,0,101,6],[106,0,106,6],[92,0,92,6],[93,0,93,6],[89,0,89,6],[105,0,105,6],[90,0,90,6],[96,0,96,6],[102,0,102,6],[103,0,103,6],[94,0,94,6],[95,0,95,6],[86,0,86,6],[85,0,85,6],[80,0,80,6],[65,0,65,6],[73,0,73,6],[74,0,74,6],[76,0,76,6],[75,0,75,6],[70,0,70,6],[82,0,82,6],[83,0,83,6],[77,0,77,6],[79,0,79,6],[81,0,81,6],[71,0,71,6],[78,0,78,6],[84,0,84,6],[8,0,8,6],[17,0,17,6],[16,0,16,6],[15,0,15,6],[14,0,14,6],[13,0,13,6],[38,0,38,6],[39,0,39,6],[40,0,40,6],[34,0,34,6],[35,0,35,6],[36,0,36,6],[37,0,37,6],[9,0,9,6],[19,0,19,6],[18,0,18,6],[10,0,10,6],[20,0,20,6],[12,0,12,6],[11,0,11,6],[43,0,43,6],[44,0,44,6],[45,0,45,6],[46,0,46,6],[47,0,47,6],[56,0,56,6],[59,0,59,6],[49,0,49,6],[48,0,48,6],[51,0,51,6],[57,0,57,6],[60,0,60,6],[50,0,50,6],[52,0,52,6],[58,0,58,6],[53,0,53,6],[54,0,54,6],[55,0,55,6],[69,0,69,6],[72,0,72,6],[62,0,62,6],[64,0,64,6],[66,0,66,6],[67,0,67,6],[68,0,68,6],[63,0,63,6],[61,0,61,6],[41,0,41,6],[42,0,42,6],[3,8,4,10],[120,8,121,10],[2,11,2,16],[33,0,33,6],[3,2,4,2],[3,3,4,3],[5,2,6,2],[5,3,6,3],[3,4,6,6],[31,0,31,6],[28,0,28,6],[29,0,29,6],[30,0,30,6],[32,0,32,6],[26,0,26,6],[27,0,27,6],[21,0,21,6],[22,0,22,6],[23,0,23,6],[24,0,24,6],[25,0,25,6],[7,0,7,6]]}
["*Project Start and End Dates must be entered first in order for template to populate.",null,null,null,null,null,null,null,null,null,null,null,null,null,null,null,"Last Revised 07/07/2017"]
["**Fill in highlighted cells applicable to your budget. All other cells will formulate."]
[null,null,null,null,null,null,null,null,null,null,null,"SPONSOR"]
[null,null,"Project Start Date:",null,{"$f":"IF(OR(D4=\"\", D6=\"\"), \"Please Enter the Start and End Date\", IF(D6<=D4,\"The end date of the project is set to a date before the start date. This is a mistake and will create errors.\",\"\"))","v":"Please Enter the Start and End Date"},null,null,null,"**DRAFT**"]
[]
[null,null,"Project End Date:",null,null,null,null,null,null,null,null,"YEAR","YEAR","YEAR","YEAR","YEAR"]
[null,null,null,null,null,null,null,null,null,null,null,"ONE","TWO","THREE","FOUR","FIVE","TOTAL"]
["A. PERSONNEL",null,null,null,null,null,null,null,"Please Enter the Appointment Type"]
["    1. Faculty ",null,null,null,null,null,null,null,"App. Type","Base Sal.","Effort %"]
[null,null,null,null,null,null,null,null,"Please Select from the List …",0,1,{"$f":"IF(I10=\"\", 0, IF(VLOOKUP(I10,'Personnel-Protected'!B1:C6,2,FALSE)=0,0,IF($I10=\"Classified Staff (12 mos)\",'Personnel-Protected'!K18,VLOOKUP(I10,'Personnel-Protected'!$H18:$K20,4,FALSE))))","v":0},{"$f":"IF(I10=\"\", 0, IF(VLOOKUP(I10,'Personnel-Protected'!B1:C6,2,FALSE)=0,0,IF($I10=\"Classified Staff (12 mos)\",'Personnel-Protected'!L18,VLOOKUP($I10,'Personnel-Protected'!H18:L20,5,FALSE))))","v":0},{"$f":"IF(I10=\"\",0,IF(VLOOKUP(I10,'Personnel-Protected'!B1:C6,2,FALSE)=0,0,IF($I10=\"Classified Staff (12 mos)\",'Personnel-Protected'!M18,VLOOKUP($I10,'Personnel-Protected'!H18:M20,6,FALSE))))","v":0},{"$f":"IF(I10=\"\",0,IF(VLOOKUP(I10,'Personnel-Protected'!B1:C6,2,FALSE)=0,0,IF($I10=\"Classified Staff (12 mos)\",'Personnel-Protected'!N18,VLOOKUP($I10,'Personnel-Protected'!H18:N20,7,FALSE))))","v":0},{"$f":"IF(I10=\"\",0,IF(VLOOKUP(I10,'Personnel-Protected'!B1:C6,2,FALSE)=0,0,IF($I10=\"Classified Staff (12 mos)\",'Personnel-Protected'!O18,VLOOKUP($I10,'Personnel-Protected'!H18:O20,8,FALSE))))","v":0},{"$f":"SUM(L10:P10)","v":0}]
[null,null,null,null,null,null,null,null,"Please Select from the List …",0,1,{"$f":"IF(I11=\"\", 0, IF(VLOOKUP(I11,'Personnel-Protected'!B1:C6,2,FALSE)=0,0,IF($I11=\"Classified Staff (12 mos)\",'Personnel-Protected'!K21,VLOOKUP(I11,'Personnel-Protected'!$H21:$K23,4,FALSE))))","v":0},{"$f":"IF(I11=\"\", 0, IF(VLOOKUP(I11,'Personnel-Protected'!B1:C6,2,FALSE)=0,0,IF($I11=\"Classified Staff (12 mos)\",'Personnel-Protected'!L21,VLOOKUP($I11,'Personnel-Protected'!H21:L23,5,FALSE))))","v":0},{"$f":"IF(I11=\"\",0,IF(VLOOKUP(I11,'Personnel-Protected'!B1:C6,2,FALSE)=0,0,IF($I11=\"Classified Staff (12 mos)\",'Personnel-Protected'!M21,VLOOKUP($I11,'Personnel-Protected'!H21:M23,6,FALSE))))","v":0},{"$f":"IF(I11=\"\",0,IF(VLOOKUP(I11,'Personnel-Protected'!B1:C6,2,FALSE)=0,0,IF($I11=\"Classified Staff (12 mos)\",'Personnel-Protected'!N21,VLOOKUP($I11,'Personnel-Protected'!H21:N23,7,FALSE))))","v":0},{"$f":"IF(I11=\"\",0,IF(VLOOKUP(I11,'Personnel-Protected'!B1:C6,2,FALSE)=0,0,IF($I11=\"Classified Staff (12 mos)\",'Personnel-Protected'!O21,VLOOKUP($I11,'Personnel-Protected'!H21:O23,8,FALSE))))","v":0},0]
[null,null,null,null,null,null,null,null,"Please Select from the List …",0,0,{"$f":"IF(I12=\"\", 0, IF(VLOOKUP(I12,'Personnel-Protected'!B1:C6,2,FALSE)=0,0,IF($I12=\"Classified Staff (12 mos)\",'Personnel-Protected'!K24,VLOOKUP(I12,'Personnel-Protected'!$H24:$K26,4,FALSE))))","v":0},{"$f":"IF(I12=\"\", 0, IF(VLOOKUP(I12,'Personnel-Protected'!B1:C6,2,FALSE)=0,0,IF($I12=\"Classified Staff (12 mos)\",'Personnel-Protected'!L24,VLOOKUP($I12,'Personnel-Protected'!H24:L26,5,FALSE))))","v":0},{"$f":"IF(I12=\"\",0,IF(VLOOKUP(I12,'Personnel-Protected'!B1:C6,2,FALSE)=0,0,IF($I12=\"Classified Staff (12 mos)\",'Personnel-Protected'!M24,VLOOKUP($I12,'Personnel-Protected'!H24:M26,6,FALSE))))","v":0},{"$f":"IF(I12=\"\",0,IF(VLOOKUP(I12,'Personnel-Protected'!B1:C6,2,FALSE)=0,0,IF($I12=\"Classified Staff (12 mos)\",'Personnel-Protected'!N24,VLOOKUP($I12,'Personnel-Protected'!H24:N26,7,FALSE))))","v":0},{"$f":"IF(I12=\"\",0,IF(VLOOKUP(I12,'Personnel-Protected'!B1:C6,2,FALSE)=0,0,IF($I12=\"Classified Staff (12 mos)\",'Personnel-Protected'!O24,VLOOKUP($I12,'Personnel-Protected'!H24:O26,8,FALSE))))","v":0},0]
[null,null,null,null,null,null,null,null,"Please Select from the List …",0,0,{"$f":"IF(I13=\"\", 0, IF(VLOOKUP(I13,'Personnel-Protected'!B1:C6,2,FALSE)=0,0,IF($I13=\"Classified Staff (12 mos)\",'Personnel-Protected'!K27,VLOOKUP(I13,'Personnel-Protected'!$H27:$K29,4,FALSE))))","v":0},{"$f":"IF(I13=\"\", 0, IF(VLOOKUP(I13,'Personnel-Protected'!B1:C6,2,FALSE)=0,0,IF($I13=\"Classified Staff (12 mos)\",'Personnel-Protected'!L27,VLOOKUP($I13,'Personnel-Protected'!H27:L29,5,FALSE))))","v":0},{"$f":"IF(I13=\"\",0,IF(VLOOKUP(I13,'Personnel-Protected'!B1:C6,2,FALSE)=0,0,IF($I13=\"Classified Staff (12 mos)\",'Personnel-Protected'!M27,VLOOKUP($I13,'Personnel-Protected'!H27:M29,6,FALSE))))","v":0},{"$f":"IF(I13=\"\",0,IF(VLOOKUP(I13,'Personnel-Protected'!B1:C6,2,FALSE)=0,0,IF($I13=\"Classified Staff (12 mos)\",'Personnel-Protected'!N27,VLOOKUP($I13,'Personnel-Protected'!H27:N29,7,FALSE))))","v":0},{"$f":"IF(I13=\"\",0,IF(VLOOKUP(I13,'Personnel-Protected'!B1:C6,2,FALSE)=0,0,IF($I13=\"Classified Staff (12 mos)\",'Personnel-Protected'!O27,VLOOKUP($I13,'Personnel-Protected'!H27:O29,8,FALSE))))","v":0},0]
[null,null,null,null,null,null,null,null,"Please Select from the List …",0,0,{"$f":"IF(I14=\"\", 0, IF(VLOOKUP(I14,'Personnel-Protected'!B1:C6,2,FALSE)=0,0,IF($I14=\"Classified Staff (12 mos)\",'Personnel-Protected'!K30,VLOOKUP(I14,'Personnel-Protected'!$H30:$K32,4,FALSE))))","v":0},{"$f":"IF(I14=\"\", 0, IF(VLOOKUP(I14,'Personnel-Protected'!B1:C6,2,FALSE)=0,0,IF($I14=\"Classified Staff (12 mos)\",'Personnel-Protected'!L30,VLOOKUP($I14,'Personnel-Protected'!H30:L32,5,FALSE))))","v":0},{"$f":"IF(I14=\"\",0,IF(VLOOKUP(I14,'Personnel-Protected'!B1:C6,2,FALSE)=0,0,IF($I14=\"Classified Staff (12 mos)\",'Personnel-Protected'!M30,VLOOKUP($I14,'Personnel-Protected'!H30:M32,6,FALSE))))","v":0},{"$f":"IF(I14=\"\",0,IF(VLOOKUP(I14,'Personnel-Protected'!B1:C6,2,FALSE)=0,0,IF($I14=\"Classified Staff (12 mos)\",'Personnel-Protected'!N30,VLOOKUP($I14,'Personnel-Protected'!H30:N32,7,FALSE))))","v":0},{"$f":"IF(I14=\"\",0,IF(VLOOKUP(I14,'Personnel-Protected'!B1:C6,2,FALSE)=0,0,IF($I14=\"Classified Staff (12 mos)\",'Personnel-Protected'!O30,VLOOKUP($I14,'Personnel-Protected'!H30:O32,8,FALSE))))","v":0},0]
[null,null,null,null,null,null,null,null,"Please Select from the List …",0,0,{"$f":"IF(I15=\"\", 0, IF(VLOOKUP(I15,'Personnel-Protected'!B1:C6,2,FALSE)=0,0,IF($I15=\"Classified Staff (12 mos)\",'Personnel-Protected'!K33,VLOOKUP(I15,'Personnel-Protected'!$H33:$K35,4,FALSE))))","v":0},{"$f":"IF(I15=\"\", 0, IF(VLOOKUP(I15,'Personnel-Protected'!B1:C6,2,FALSE)=0,0,IF($I15=\"Classified Staff (12 mos)\",'Personnel-Protected'!L33,VLOOKUP($I15,'Personnel-Protected'!H33:L35,5,FALSE))))","v":0},{"$f":"IF(I15=\"\",0,IF(VLOOKUP(I15,'Personnel-Protected'!B1:C6,2,FALSE)=0,0,IF($I15=\"Classified Staff (12 mos)\",'Personnel-Protected'!M33,VLOOKUP($I15,'Personnel-Protected'!H33:M35,6,FALSE))))","v":0},{"$f":"IF(I15=\"\",0,IF(VLOOKUP(I15,'Personnel-Protected'!B1:C6,2,FALSE)=0,0,IF($I15=\"Classified Staff (12 mos)\",'Personnel-Protected'!N33,VLOOKUP($I15,'Personnel-Protected'!H33:N35,7,FALSE))))","v":0},{"$f":"IF(I15=\"\",0,IF(VLOOKUP(I15,'Personnel-Protected'!B1:C6,2,FALSE)=0,0,IF($I15=\"Classified Staff (12 mos)\",'Personnel-Protected'!O33,VLOOKUP($I15,'Personnel-Protected'!H33:O35,8,FALSE))))","v":0},0]
{"$rows_left_out":135}
{"sheet":"Cost Share","index":1,"n_rows":149,"n_cols":17,"rows_kept":149,"cut":false,"hidden":false,"merged":[[145,0,145,7],[147,0,147,4],[148,0,148,4],[136,0,136,4],[136,5,136,7],[138,0,138,8],[140,0,140,7],[141,0,141,7],[142,0,142,8],[133,0,133,4],[133,5,133,7],[134,0,134,4],[134,5,134,7],[135,0,135,4],[135,5,135,7],[128,0,128,3],[128,4,128,7],[130,0,130,3],[130,4,130,7],[132,0,132,4],[132,5,132,7],[125,0,125,3],[125,4,125,7],[126,0,126,3],[126,4,126,7],[127,0,127,3],[127,4,127,7],[122,0,122,3],[122,4,122,7],[123,0,123,3],[123,4,123,7],[124,0,124,3],[124,4,124,7],[117,0,117,6],[118,0,118,6],[119,0,119,6],[120,0,120,6],[120,8,121,10],[121,0,121,7],[110,0,110,6],[111,0,111,6],[112,0,112,6],[113,0,113,6],[115,0,115,6],[116,0,116,6],[103,0,103,6],[105,0,105,6],[106,0,106,6],[107,0,107,6],[108,0,108,6],[109,0,109,6],[97,0,97,6],[98,0,98,6],[99,0,99,6],[100,0,100,6],[101,0,101,6],[102,0,102,6],[91,0,91,6],[92,0,92,6],[93,0,93,6],[94,0,94,6],[95,0,95,6],[96,0,96,6],[85,0,85,6],[86,0,86,6],[87,0,87,6],[88,0,88,6],[89,0,89,6],[90,0,90,6],[79,0,79,6],[80,0,80,6],[81,0,81,6],[82,0,82,6],[83,0,83,6],[84,0,84,6],[73,0,73,6],[74,0,74,6],[75,0,75,6],[76,0,76,6],[77,0,77,6],[78,0,78,6],[67,0,67,6],[68,0,68,6],[69,0,69,6],[70,0,70,6],[71,0,71,6],[72,0,72,6],[61,0,61,6],[62,0,62,6],[63,0,63,6],[64,0,64,6],[65,0,65,6],[66,0,66,6],[55,0,55,6],[56,0,56,6],[57,0,57,6],[58,0,58,6],[59,0,59,6],[60,0,60,6],[49,0,49,6],[50,0,50,6],[51,0,51,6],[52,0,52,6],[53,0,53,6],[54,0,54,6],[43,0,43,6],[44,0,44,6],[45,0,45,6],[46,0,46,6],[47,0,47,6],[48,0,48,6],[37,0,37,6],[38,0,38,6],[39,0,39,6],[40,0,40,6],[41,0,41,6],[42,0,42,6],[31,0,31,6],[32,0,32,6],[33,0,33,6],[34,0,34,6],[35,0,35,6],[36,0,36,6],[25,0,25,6],[26,0,26,6],[27,0,27,6],[28,0,28,6],[29,0,29,6],[30,0,30,6],[19,0,19,6],[20,0,20,6],[21,0,21,6],[22,0,22,6],[23,0,23,6],[24,0,24,6],[13,0,13,6],[14,0,14,6],[15,0,15,6],[16,0,16,6],[17,0,17,6],[18,0,18,6],[7,0,7,6],[8,0,8,6],[9,0,9,6],[10,0,10,6],[11,0,11,6],[12,0,12,6],[0,16,1,16],[2,11,2,16],[3,2,4,2],[3,3,4,3],[3,4,6,6],[3,8,4,10],[5,2,6,2],[5,3,6,3]]}
["*Project Start and End Dates must be entered first in order for template to populate.",null,null,null,null,null,null,null,null,null,null,null,null,null,null,null,{"$f":"Budget!Q1","v":"Last Revised 07/07/2017"}]
["**Fill in highlighted cells applicable to your budget. All other cells will formulate."]
[null,null,null,null,null,null,null,null,null,null,null,"SPONSOR"]
[null,null,"Project Start Date:",{"$f":"Budget!D4","v":"00:00:00"},{"$f":"IF(OR(D4=\"\", D6=\"\"), \"Please Enter the Start and End Date\", IF(D6<=D4,\"The end date of the project is set to a date before the start date. This is a mistake and will create errors.\",\"\"))","v":"The end date of the project is set to a date before the start date. This is a mistake and will create errors."},null,null,null,"**DRAFT**"]
[]
[null,null,"Project End Date:",{"$f":"Budget!D6","v":"00:00:00"},null,null,null,null,null,null,null,"YEAR","YEAR","YEAR","YEAR","YEAR"]
[null,null,null,null,null,null,null,null,null,null,null,"ONE","TWO","THREE","FOUR","FIVE","TOTAL"]
["A. PERSONNEL",null,null,null,null,null,null,null,"Please Enter the Appointment Type"]
["    1. Faculty ",null,null,null,null,null,null,null,"App. Type","Base Sal.","Effort %"]
[null,null,null,null,null,null,null,null,"Please Select from the List …",0,0,{"$f":"IF(I10=\"\", 0, IF(VLOOKUP(I10,'Personnel-Protected'!B1:C6,2,FALSE)=0,0,IF($I10=\"Classified Staff (12 mos)\",'Personnel-Protected'!K79,VLOOKUP(I10,'Personnel-Protected'!$H79:$K81,4,FALSE))))","v":0},{"$f":"IF(I10=\"\", 0, IF(VLOOKUP(I10,'Personnel-Protected'!B1:C6,2,FALSE)=0,0,IF($I10=\"Classified Staff (12 mos)\",'Personnel-Protected'!L18,VLOOKUP($I10,'Personnel-Protected'!H79:L81,5,FALSE))))","v":0},{"$f":"IF(I10=\"\",0,IF(VLOOKUP(I10,'Personnel-Protected'!B1:C6,2,FALSE)=0,0,IF($I10=\"Classified Staff (12 mos)\",'Personnel-Protected'!M18,VLOOKUP($I10,'Personnel-Protected'!H79:M81,6,FALSE))))","v":0},{"$f":"IF(I10=\"\",0,IF(VLOOKUP(I10,'Personnel-Protected'!B1:C6,2,FALSE)=0,0,IF($I10=\"Classified Staff (12 mos)\",'Personnel-Protected'!N18,VLOOKUP($I10,'Personnel-Protected'!H79:N81,7,FALSE))))","v":0},{"$f":"IF(I10=\"\",0,IF(VLOOKUP(I10,'Personnel-Protected'!B1:C6,2,FALSE)=0,0,IF($I10=\"Classified Staff (12 mos)\",'Personnel-Protected'!O18,VLOOKUP($I10,'Personnel-Protected'!H79:O81,8,FALSE))))","v":0},{"$f":"SUM(L10:P10)","v":0}]
[null,null,null,null,null,null,null,null,"Please Select from the List …",0,0,{"$f":"IF(I11=\"\", 0, IF(VLOOKUP(I11,'Personnel-Protected'!B1:C6,2,FALSE)=0,0,IF($I11=\"Classified Staff (12 mos)\",'Personnel-Protected'!K21,VLOOKUP(I11,'Personnel-Protected'!$H82:$K84,4,FALSE))))","v":0},{"$f":"IF(I11=\"\", 0, IF(VLOOKUP(I11,'Personnel-Protected'!B1:C6,2,FALSE)=0,0,IF($I11=\"Classified Staff (12 mos)\",'Personnel-Protected'!L21,VLOOKUP($I11,'Personnel-Protected'!H82:L84,5,FALSE))))","v":0},{"$f":"IF(I11=\"\",0,IF(VLOOKUP(I11,'Personnel-Protected'!B1:C6,2,FALSE)=0,0,IF($I11=\"Classified Staff (12 mos)\",'Personnel-Protected'!M21,VLOOKUP($I11,'Personnel-Protected'!H82:M84,6,FALSE))))","v":0},{"$f":"IF(I11=\"\",0,IF(VLOOKUP(I11,'Personnel-Protected'!B1:C6,2,FALSE)=0,0,IF($I11=\"Classified Staff (12 mos)\",'Personnel-Protected'!N21,VLOOKUP($I11,'Personnel-Protected'!H82:N84,7,FALSE))))","v":0},{"$f":"IF(I11=\"\",0,IF(VLOOKUP(I11,'Personnel-Protected'!B1:C6,2,FALSE)=0,0,IF($I11=\"Classified Staff (12 mos)\",'Personnel-Protected'!O21,VLOOKUP($I11,'Personnel-Protected'!H82:O84,8,FALSE))))","v":0},0]
[null,null,null,null,null,null,null,null,"Please Select from the List …",0,0,{"$f":"IF(I12=\"\", 0, IF(VLOOKUP(I12,'Personnel-Protected'!B1:C6,2,FALSE)=0,0,IF($I12=\"Classified Staff (12 mos)\",'Personnel-Protected'!K24,VLOOKUP(I12,'Personnel-Protected'!$H85:$K87,4,FALSE))))","v":0},{"$f":"IF(I12=\"\", 0, IF(VLOOKUP(I12,'Personnel-Protected'!B1:C6,2,FALSE)=0,0,IF($I12=\"Classified Staff (12 mos)\",'Personnel-Protected'!L24,VLOOKUP($I12,'Personnel-Protected'!H85:L87,5,FALSE))))","v":0},{"$f":"IF(I12=\"\",0,IF(VLOOKUP(I12,'Personnel-Protected'!B1:C6,2,FALSE)=0,0,IF($I12=\"Classified Staff (12 mos)\",'Personnel-Protected'!M24,VLOOKUP($I12,'Personnel-Protected'!H85:M87,6,FALSE))))","v":0},{"$f":"IF(I12=\"\",0,IF(VLOOKUP(I12,'Personnel-Protected'!B1:C6,2,FALSE)=0,0,IF($I12=\"Classified Staff (12 mos)\",'Personnel-Protected'!N24,VLOOKUP($I12,'Personnel-Protected'!H85:N87,7,FALSE))))","v":0},{"$f":"IF(I12=\"\",0,IF(VLOOKUP(I12,'Personnel-Protected'!B1:C6,2,FALSE)=0,0,IF($I12=\"Classified Staff (12 mos)\",'Personnel-Protected'!O24,VLOOKUP($I12,'Personnel-Protected'!H85:O87,8,FALSE))))","v":0},0]
[null,null,null,null,null,null,null,null,"Please Select from the List …",0,0,{"$f":"IF(I13=\"\", 0, IF(VLOOKUP(I13,'Personnel-Protected'!B1:C6,2,FALSE)=0,0,IF($I13=\"Classified Staff (12 mos)\",'Personnel-Protected'!K27,VLOOKUP(I13,'Personnel-Protected'!$H88:$K90,4,FALSE))))","v":0},{"$f":"IF(I13=\"\", 0, IF(VLOOKUP(I13,'Personnel-Protected'!B1:C6,2,FALSE)=0,0,IF($I13=\"Classified Staff (12 mos)\",'Personnel-Protected'!L27,VLOOKUP($I13,'Personnel-Protected'!H88:L90,5,FALSE))))","v":0},{"$f":"IF(I13=\"\",0,IF(VLOOKUP(I13,'Personnel-Protected'!B1:C6,2,FALSE)=0,0,IF($I13=\"Classified Staff (12 mos)\",'Personnel-Protected'!M27,VLOOKUP($I13,'Personnel-Protected'!H88:M90,6,FALSE))))","v":0},{"$f":"IF(I13=\"\",0,IF(VLOOKUP(I13,'Personnel-Protected'!B1:C6,2,FALSE)=0,0,IF($I13=\"Classified Staff (12 mos)\",'Personnel-Protected'!N27,VLOOKUP($I13,'Personnel-Protected'!H88:N90,7,FALSE))))","v":0},{"$f":"IF(I13=\"\",0,IF(VLOOKUP(I13,'Personnel-Protected'!B1:C6,2,FALSE)=0,0,IF($I13=\"Classified Staff (12 mos)\",'Personnel-Protected'!O27,VLOOKUP($I13,'Personnel-Protected'!H88:O90,8,FALSE))))","v":0},0]
[null,null,null,null,null,null,null,null,"Please Select from the List …",0,0,{"$f":"IF(I14=\"\", 0, IF(VLOOKUP(I14,'Personnel-Protected'!B1:C6,2,FALSE)=0,0,IF($I14=\"Classified Staff (12 mos)\",'Personnel-Protected'!K30,VLOOKUP(I14,'Personnel-Protected'!$H91:$K93,4,FALSE))))","v":0},{"$f":"IF(I14=\"\", 0, IF(VLOOKUP(I14,'Personnel-Protected'!B1:C6,2,FALSE)=0,0,IF($I14=\"Classified Staff (12 mos)\",'Personnel-Protected'!L30,VLOOKUP($I14,'Personnel-Protected'!H91:L93,5,FALSE))))","v":0},{"$f":"IF(I14=\"\",0,IF(VLOOKUP(I14,'Personnel-Protected'!B1:C6,2,FALSE)=0,0,IF($I14=\"Classified Staff (12 mos)\",'Personnel-Protected'!M30,VLOOKUP($I14,'Personnel-Protected'!H91:M93,6,FALSE))))","v":0},{"$f":"IF(I14=\"\",0,IF(VLOOKUP(I14,'Personnel-Protected'!B1:C6,2,FALSE)=0,0,IF($I14=\"Classified Staff (12 mos)\",'Personnel-Protected'!N30,VLOOKUP($I14,'Personnel-Protected'!H91:N93,7,FALSE))))","v":0},{"$f":"IF(I14=\"\",0,IF(VLOOKUP(I14,'Personnel-Protected'!B1:C6,2,FALSE)=0,0,IF($I14=\"Classified Staff (12 mos)\",'Personnel-Protected'!O30,VLOOKUP($I14,'Personnel-Protected'!H91:O93,8,FALSE))))","v":0},0]
[null,null,null,null,null,null,null,null,"Please Select from the List …",0,0,{"$f":"IF(I15=\"\", 0, IF(VLOOKUP(I15,'Personnel-Protected'!B1:C6,2,FALSE)=0,0,IF($I15=\"Classified Staff (12 mos)\",'Personnel-Protected'!K33,VLOOKUP(I15,'Personnel-Protected'!$H94:$K96,4,FALSE))))","v":0},{"$f":"IF(I15=\"\", 0, IF(VLOOKUP(I15,'Personnel-Protected'!B1:C6,2,FALSE)=0,0,IF($I15=\"Classified Staff (12 mos)\",'Personnel-Protected'!L33,VLOOKUP($I15,'Personnel-Protected'!H94:L96,5,FALSE))))","v":0},{"$f":"IF(I15=\"\",0,IF(VLOOKUP(I15,'Personnel-Protected'!B1:C6,2,FALSE)=0,0,IF($I15=\"Classified Staff (12 mos)\",'Personnel-Protected'!M33,VLOOKUP($I15,'Personnel-Protected'!H94:M96,6,FALSE))))","v":0},{"$f":"IF(I15=\"\",0,IF(VLOOKUP(I15,'Personnel-Protected'!B1:C6,2,FALSE)=0,0,IF($I15=\"Classified Staff (12 mos)\",'Personnel-Protected'!N33,VLOOKUP($I15,'Personnel-Protected'!H94:N96,7,FALSE))))","v":0},{"$f":"IF(I15=\"\",0,IF(VLOOKUP(I15,'Personnel-Protected'!B1:C6,2,FALSE)=0,0,IF($I15=\"Classified Staff (12 mos)\",'Personnel-Protected'!O33,VLOOKUP($I15,'Personnel-Protected'!H94:O96,8,FALSE))))","v":0},0]
{"$rows_left_out":135}
{"sheet":"Source-Protected","index":2,"n_rows":20,"n_cols":2,"rows_kept":20,"cut":false,"hidden":false,"merged":[]}
["     Instruction (INS)"]
["     Organized Research (OR)"]
["     Other Sponsored Activities (OSA)"]
[]
["Please Select an option from the list",0]
["     57.2% MTDC (On-Campus, INS)",0.57199999999999995]
["     39.6% MTDC (Adjacent, INS)",0.39600000000000002]
["     26.00% MTDC (Off-Campus, INS)",0.26]
["     52.% MTDC (On-Campus, OR) ",0.52]
["     27.4% MTDC (Adjacent, OR) ",0.27400000000000002]
["     26.0% MTDC (Off-Campus, OR)",0.26]
["     54.3% MTDC (DoD, On-Campus, OR) ",0.54300000000000004]
["     29.7% MTDC (DoD, Adjacent, OR) ",0.29699999999999999]
["     28.3% MTDC (DoD, Off-Campus, OR) ",0.28299999999999997]
["     38.7% MTDC (On-Campus, OSA)",0.38700000000000001]
{"$rows_left_out":6}
{"sheet":"Personnel-Protected","index":3,"n_rows":135,"n_cols":21,"rows_kept":135,"cut":false,"hidden":false,"merged":[[59,6,61,6],[62,6,64,6],[65,6,67,6],[68,6,70,6],[71,6,73,6],[44,6,46,6],[47,6,49,6],[50,6,52,6],[53,6,55,6],[56,6,58,6],[29,6,31,6],[32,6,34,6],[35,6,37,6],[38,6,40,6],[41,6,43,6],[8,2,9,2],[17,6,19,6],[20,6,22,6],[23,6,25,6],[26,6,28,6],[78,6,80,6],[81,6,83,6],[84,6,86,6],[87,6,89,6],[90,6,92,6],[93,6,95,6],[96,6,98,6],[99,6,101,6],[102,6,104,6],[105,6,107,6],[123,6,125,6],[126,6,128,6],[129,6,131,6],[132,6,134,6],[108,6,110,6],[111,6,113,6],[114,6,116,6],[117,6,119,6],[120,6,122,6]]}
[null,"Type","Days"]
["Appointment Types:","Please Select from the List …",0]
[null,"Faculty Calendar Year (12 mos)",365,null,null,null,null,null,null,{"$f":"VLOOKUP(B2,B1:C5,2,FALSE)","v":0},null,null,null,null,null,"2013-05-20",null,"2013-05-30"]
[null,"Faculty Academic Year (9 mos)",273,null,null,null,null,null,null,{"$f":"VLOOKUP(B3,B1:C5,2)","v":365},null,"Year 1 Start Date",{"$f":"StartDate","v":"00:00:00"},"Year 1 End Date",{"$f":"IF(EndDate<Y2Start, EndDate,Y2Start-1)","v":"00:00:00"},"Year 1 Summer Start Date",{"$f":"DATE(YEAR(M4), 5, 25)","v":"1900-05-25"},"Year 1 Summer End Date",{"$f":"DATE(YEAR(M4), 8, 24)","v":"1900-08-24"},"Year 1 Sal. Esc. Date",{"$f":"EscalationDate","v":"1900-12-31"}]
[null,"Classified Staff (12 mos)",365,null,null,null,null,null,null,{"$f":"VLOOKUP(B4,B1:C5,2,FALSE)","v":273},null,"Year 2 Start Date",{"$f":"DATE(YEAR(M4)+1, MONTH(M4), DAY(M4))","v":"1900-12-31"},"Year 2 End Date",{"$f":"IF(EndDate<Y2Start, EndDate,Y3Start-1)","v":"00:00:00"},"Year 2 Summer Start Date","1900-05-25","Year 2 Summer End Date",{"$f":"DATE(YEAR(M5), 8, 24)","v":"1900-08-24"},"Year 2 Sal. Esc. Date",{"$f":"Y3Start","v":"1901-12-31"}]
[null,"Summer Faculty (3 mos)",91,null,null,null,null,null,null,null,null,"Year 3 Start Date",{"$f":"DATE(YEAR(M5)+1, MONTH(M5), DAY(M5))","v":"1901-12-31"},"Year 3 End Date",{"$f":"IF(EndDate<Y2Start, EndDate,Y4Start-1)","v":"00:00:00"},"Year 3 Summer Start Date","1901-05-25","Year 3 Summer End Date","1901-08-24","Year 3 Sal. Esc. Date",{"$f":"Y4Start","v":"1902-12-31"}]
[null,null,null,null,null,null,null,null,null,null,null,"Year 4 start Date","1902-12-31","Year 4 End Date",{"$f":"IF(EndDate<Y2Start, EndDate,Y5Start-1)","v":"00:00:00"},"Year 4 Summer Start Date","1902-05-25","Year 4 Summer End Date","1902-08-24","Year 4 Sal. Esc. Date",{"$f":"Y5Start","v":"1903-12-31"}]
["Escalator Std.",0.03,null,null,null,null,null,null,null,null,null,"Year 5 Start Date","1903-12-31","Year 5 End Date",{"$f":"IF(EndDate<Y2Start, EndDate,Y6Start-1)","v":"00:00:00"},"Year 5 Summer Start Date","1903-05-25","Year 5 Summer End Date","1903-08-24","Year 5 Sal. Esc. Date",{"$f":"Y6Start","v":"1904-12-31"}]
["Start Date:",{"$f":"Budget!D4","v":"00:00:00"},{"$f":"IF(B10-B9>0,B10-B9,0)","v":366},"# of days after Start Date til Salary Escalation Date",null,null,null,null,null,null,null,"Year 6 Start Date","1904-12-31","Year 6 End Date",null,"Year 6 Summer Start Date","1904-05-25","Year 6 Summer End Date","1904-08-24","Year 6 Sal. Esc. Date",{"$f":"Y5EscDate+365","v":"1905-12-31"}]
["Sal. Esc. Date:",{"$f":"Y2Start","v":"1900-12-31"}]
["End Date:",{"$f":"Budget!D6","v":"00:00:00"},{"$f":"IF(B11-B9>0,B11-B9,0)","v":0},"# of days between Start Date and End Date of project"]
["Acad. Cal. Begin:","2017-08-25",{"$f":"IF(B9-B12>0,B9-B12,0)","v":0},"# of days between Academic Year Begin Date and Start Date of project"]
["Acad. Cal. End:","2018-05-24",{"$f":"IF(B13-B10>0,B13-B10,0)","v":42878},"# of days after Salary Escalation Date to end of Academic Calendar Year"]
[null,null,{"$f":"IF(EndDate>EscalationDate, EndDate-EscalationDate, 0)","v":0},"#Days Between Raise and End of Project"]
[null,null,{"$f":"Acad.Cal.End-StartDate","v":43244},"#Days Between Start Date and End of Calendar Year"]
{"$rows_left_out":120}